{"text_format":"1","workbook":"xlsx","n_sheets":4,"sheets":["Add new users here!","Instructions","Do not edit - CSV list","Do not edit - Options"],"not_rendered":{"charts":0,"images":0,"macros":1,"external_links":0,"defined_names":1,"comments":0,"pivot_tables":0},"unopened":[],"bounds":{"document_bytes":16777216,"sheet_cells":100000,"rows_first":2000,"rows_last":500,"rows_between":2000,"halvings":0,"cell_chars":16384,"cell_head_chars":4096},"cells_cut":0,"cells_raw":0,"read":"whole","date_system":"1900"}

{"sheet":"Add new users here!","index":0,"n_rows":3,"n_cols":10,"rows_kept":3,"cut":false,"hidden":false,"merged":[[0,0,0,4],[0,5,0,9],[1,9,2,9],[1,0,2,0],[1,1,2,1],[1,2,2,2],[1,5,1,7],[1,4,2,4],[1,3,2,3],[1,8,2,8]]}
["Required fields",null,null,null,null,"Optional fields"]
["Email","Last name","First name","Language","Responsible person (email)","Account end date (if empty, account is active 1 year)",null,null,"Course short name","Role in course"]
[null,null,null,null,null,"Day","Month","Year"]

{"sheet":"Instructions","index":1,"n_rows":73,"n_cols":2,"rows_kept":73,"cut":false,"hidden":false,"merged":[]}
["Instructions"]
[]
["Ohjeet suomeksi"]
["Instructions in English"]
[]
["1. List new users"]
[]
["Go to \"Add new users here!\" worksheet"]
[]
["Required fields"]
["Email","User's email address.  NOTE! Users with user account of another Finnish University can login to TUNI Moodle through HAKA login. Do not order an additional special Moodle account for these users."]
["Last name","User's last name"]
["First name","User's first name"]
["Language","Default Moodle user interface language, valid values: \"en\", \"fi\""]
["Responsible person (email)","For example your own email or other responsible person's email"]
[]
["Optional fields"]
["Account end date","Date when user account will be inactivated. If left empty, user account will be valid one year.  If user account has been inactive over one year, user account will be deleted."]
["Course short name","If user should be added to course, check exact course short name from course settings"]
["Role in course","User's role in course, valid values: \"student\", \"teacher\", \"non-editing teacher\""]
{"$rows_left_out":54}
{"sheet":"Do not edit - CSV list","index":2,"n_rows":500,"n_cols":9,"rows_kept":500,"cut":false,"hidden":true,"merged":[]}
["email","lastname","firstname","lang","profile_field_responsibleperson","profile_field_accountvalid","course1","role1","username"]
[{"$f":"IF('Add new users here!'!A4<>\"\",LOWER('Add new users here!'!A4),\"\")","v":""},{"$f":"IF('Add new users here!'!B4<>\"\",'Add new users here!'!B4,\"\")","v":""},{"$f":"IF('Add new users here!'!C4<>\"\",'Add new users here!'!C4,\"\")","v":""},{"$f":"IF('Add new users here!'!D4<>\"\",'Add new users here!'!D4,\"\")","v":""},{"$f":"IF('Add new users here!'!E4<>\"\",LOWER('Add new users here!'!E4),\"\")","v":""},{"$f":"IF('Add new users here!'!H4<>\"\",(DATE('Add new users here!'!H4,'Add new users here!'!G4,'Add new users here!'!F4)-DATE(1970,1,1))*86400,IF('Add new users here!'!A4<>\"\",((TODAY()+365)-DATE(1970,1,1))*86400,\"\"))","v":""},{"$f":"IF('Add new users here!'!I4<>\"\",'Add new users here!'!I4,\"\")","v":""},{"$f":"IF('Add new users here!'!J4<>\"\",IF('Add new users here!'!J4='Do not edit - Options'!$E$2,'Do not edit - Options'!$F$2,IF('Add new users here!'!J4='Do not edit - Options'!$E$3,'Do not edit - Options'!$F$3,IF('Add new users here!'!J4='Do not edit - Options'!$E$4,'Do not edit - Options'!$F$4,\"\"))),\"\")","v":""},{"$f":"IF('Add new users here!'!A4<>\"\",LOWER('Add new users here!'!A4),\"\")","v":""}]
[{"$f":"IF('Add new users here!'!A5<>\"\",LOWER('Add new users here!'!A5),\"\")","v":""},{"$f":"IF('Add new users here!'!B5<>\"\",'Add new users here!'!B5,\"\")","v":""},{"$f":"IF('Add new users here!'!C5<>\"\",'Add new users here!'!C5,\"\")","v":""},{"$f":"IF('Add new users here!'!D5<>\"\",'Add new users here!'!D5,\"\")","v":""},{"$f":"IF('Add new users here!'!E5<>\"\",LOWER('Add new users here!'!E5),\"\")","v":""},{"$f":"IF('Add new users here!'!H5<>\"\",(DATE('Add new users here!'!H5,'Add new users here!'!G5,'Add new users here!'!F5)-DATE(1970,1,1))*86400,IF('Add new users here!'!A5<>\"\",((TODAY()+365)-DATE(1970,1,1))*86400,\"\"))","v":""},{"$f":"IF('Add new users here!'!I5<>\"\",'Add new users here!'!I5,\"\")","v":""},{"$f":"IF('Add new users here!'!J5<>\"\",IF('Add new users here!'!J5='Do not edit - Options'!$E$2,'Do not edit - Options'!$F$2,IF('Add new users here!'!J5='Do not edit - Options'!$E$3,'Do not edit - Options'!$F$3,IF('Add new users here!'!J5='Do not edit - Options'!$E$4,'Do not edit - Options'!$F$4,\"\"))),\"\")","v":""},{"$f":"IF('Add new users here!'!A5<>\"\",LOWER('Add new users here!'!A5),\"\")","v":""}]
[{"$f":"IF('Add new users here!'!A6<>\"\",LOWER('Add new users here!'!A6),\"\")","v":""},{"$f":"IF('Add new users here!'!B6<>\"\",'Add new users here!'!B6,\"\")","v":""},{"$f":"IF('Add new users here!'!C6<>\"\",'Add new users here!'!C6,\"\")","v":""},{"$f":"IF('Add new users here!'!D6<>\"\",'Add new users here!'!D6,\"\")","v":""},{"$f":"IF('Add new users here!'!E6<>\"\",LOWER('Add new users here!'!E6),\"\")","v":""},{"$f":"IF('Add new users here!'!H6<>\"\",(DATE('Add new users here!'!H6,'Add new users here!'!G6,'Add new users here!'!F6)-DATE(1970,1,1))*86400,IF('Add new users here!'!A6<>\"\",((TODAY()+365)-DATE(1970,1,1))*86400,\"\"))","v":""},{"$f":"IF('Add new users here!'!I6<>\"\",'Add new users here!'!I6,\"\")","v":""},{"$f":"IF('Add new users here!'!J6<>\"\",IF('Add new users here!'!J6='Do not edit - Options'!$E$2,'Do not edit - Options'!$F$2,IF('Add new users here!'!J6='Do not edit - Options'!$E$3,'Do not edit - Options'!$F$3,IF('Add new users here!'!J6='Do not edit - Options'!$E$4,'Do not edit - Options'!$F$4,\"\"))),\"\")","v":""},{"$f":"IF('Add new users here!'!A6<>\"\",LOWER('Add new users here!'!A6),\"\")","v":""}]
[{"$f":"IF('Add new users here!'!A7<>\"\",LOWER('Add new users here!'!A7),\"\")","v":""},{"$f":"IF('Add new users here!'!B7<>\"\",'Add new users here!'!B7,\"\")","v":""},{"$f":"IF('Add new users here!'!C7<>\"\",'Add new users here!'!C7,\"\")","v":""},{"$f":"IF('Add new users here!'!D7<>\"\",'Add new users here!'!D7,\"\")","v":""},{"$f":"IF('Add new users here!'!E7<>\"\",LOWER('Add new users here!'!E7),\"\")","v":""},{"$f":"IF('Add new users here!'!H7<>\"\",(DATE('Add new users here!'!H7,'Add new users here!'!G7,'Add new users here!'!F7)-DATE(1970,1,1))*86400,IF('Add new users here!'!A7<>\"\",((TODAY()+365)-DATE(1970,1,1))*86400,\"\"))","v":""},{"$f":"IF('Add new users here!'!I7<>\"\",'Add new users here!'!I7,\"\")","v":""},{"$f":"IF('Add new users here!'!J7<>\"\",IF('Add new users here!'!J7='Do not edit - Options'!$E$2,'Do not edit - Options'!$F$2,IF('Add new users here!'!J7='Do not edit - Options'!$E$3,'Do not edit - Options'!$F$3,IF('Add new users here!'!J7='Do not edit - Options'!$E$4,'Do not edit - Options'!$F$4,\"\"))),\"\")","v":""},{"$f":"IF('Add new users here!'!A7<>\"\",LOWER('Add new users here!'!A7),\"\")","v":""}]
[{"$f":"IF('Add new users here!'!A8<>\"\",LOWER('Add new users here!'!A8),\"\")","v":""},{"$f":"IF('Add new users here!'!B8<>\"\",'Add new users here!'!B8,\"\")","v":""},{"$f":"IF('Add new users here!'!C8<>\"\",'Add new users here!'!C8,\"\")","v":""},{"$f":"IF('Add new users here!'!D8<>\"\",'Add new users here!'!D8,\"\")","v":""},{"$f":"IF('Add new users here!'!E8<>\"\",LOWER('Add new users here!'!E8),\"\")","v":""},{"$f":"IF('Add new users here!'!H8<>\"\",(DATE('Add new users here!'!H8,'Add new users here!'!G8,'Add new users here!'!F8)-DATE(1970,1,1))*86400,IF('Add new users here!'!A8<>\"\",((TODAY()+365)-DATE(1970,1,1))*86400,\"\"))","v":""},{"$f":"IF('Add new users here!'!I8<>\"\",'Add new users here!'!I8,\"\")","v":""},{"$f":"IF('Add new users here!'!J8<>\"\",IF('Add new users here!'!J8='Do not edit - Options'!$E$2,'Do not edit - Options'!$F$2,IF('Add new users here!'!J8='Do not edit - Options'!$E$3,'Do not edit - Options'!$F$3,IF('Add new users here!'!J8='Do not edit - Options'!$E$4,'Do not edit - Options'!$F$4,\"\"))),\"\")","v":""},{"$f":"IF('Add new users here!'!A8<>\"\",LOWER('Add new users here!'!A8),\"\")","v":""}]
[{"$f":"IF('Add new users here!'!A9<>\"\",LOWER('Add new users here!'!A9),\"\")","v":""},{"$f":"IF('Add new users here!'!B9<>\"\",'Add new users here!'!B9,\"\")","v":""},{"$f":"IF('Add new users here!'!C9<>\"\",'Add new users here!'!C9,\"\")","v":""},{"$f":"IF('Add new users here!'!D9<>\"\",'Add new users here!'!D9,\"\")","v":""},{"$f":"IF('Add new users here!'!E9<>\"\",LOWER('Add new users here!'!E9),\"\")","v":""},{"$f":"IF('Add new users here!'!H9<>\"\",(DATE('Add new users here!'!H9,'Add new users here!'!G9,'Add new users here!'!F9)-DATE(1970,1,1))*86400,IF('Add new users here!'!A9<>\"\",((TODAY()+365)-DATE(1970,1,1))*86400,\"\"))","v":""},{"$f":"IF('Add new users here!'!I9<>\"\",'Add new users here!'!I9,\"\")","v":""},{"$f":"IF('Add new users here!'!J9<>\"\",IF('Add new users here!'!J9='Do not edit - Options'!$E$2,'Do not edit - Options'!$F$2,IF('Add new users here!'!J9='Do not edit - Options'!$E$3,'Do not edit - Options'!$F$3,IF('Add new users here!'!J9='Do not edit - Options'!$E$4,'Do not edit - Options'!$F$4,\"\"))),\"\")","v":""},{"$f":"IF('Add new users here!'!A9<>\"\",LOWER('Add new users here!'!A9),\"\")","v":""}]
[{"$f":"IF('Add new users here!'!A10<>\"\",LOWER('Add new users here!'!A10),\"\")","v":""},{"$f":"IF('Add new users here!'!B10<>\"\",'Add new users here!'!B10,\"\")","v":""},{"$f":"IF('Add new users here!'!C10<>\"\",'Add new users here!'!C10,\"\")","v":""},{"$f":"IF('Add new users here!'!D10<>\"\",'Add new users here!'!D10,\"\")","v":""},{"$f":"IF('Add new users here!'!E10<>\"\",LOWER('Add new users here!'!E10),\"\")","v":""},{"$f":"IF('Add new users here!'!H10<>\"\",(DATE('Add new users here!'!H10,'Add new users here!'!G10,'Add new users here!'!F10)-DATE(1970,1,1))*86400,IF('Add new users here!'!A10<>\"\",((TODAY()+365)-DATE(1970,1,1))*86400,\"\"))","v":""},{"$f":"IF('Add new users here!'!I10<>\"\",'Add new users here!'!I10,\"\")","v":""},{"$f":"IF('Add new users here!'!J10<>\"\",IF('Add new users here!'!J10='Do not edit - Options'!$E$2,'Do not edit - Options'!$F$2,IF('Add new users here!'!J10='Do not edit - Options'!$E$3,'Do not edit - Options'!$F$3,IF('Add new users here!'!J10='Do not edit - Options'!$E$4,'Do not edit - Options'!$F$4,\"\"))),\"\")","v":""},{"$f":"IF('Add new users here!'!A10<>\"\",LOWER('Add new users here!'!A10),\"\")","v":""}]
[{"$f":"IF('Add new users here!'!A11<>\"\",LOWER('Add new users here!'!A11),\"\")","v":""},{"$f":"IF('Add new users here!'!B11<>\"\",'Add new users here!'!B11,\"\")","v":""},{"$f":"IF('Add new users here!'!C11<>\"\",'Add new users here!'!C11,\"\")","v":""},{"$f":"IF('Add new users here!'!D11<>\"\",'Add new users here!'!D11,\"\")","v":""},{"$f":"IF('Add new users here!'!E11<>\"\",LOWER('Add new users here!'!E11),\"\")","v":""},{"$f":"IF('Add new users here!'!H11<>\"\",(DATE('Add new users here!'!H11,'Add new users here!'!G11,'Add new users here!'!F11)-DATE(1970,1,1))*86400,IF('Add new users here!'!A11<>\"\",((TODAY()+365)-DATE(1970,1,1))*86400,\"\"))","v":""},{"$f":"IF('Add new users here!'!I11<>\"\",'Add new users here!'!I11,\"\")","v":""},{"$f":"IF('Add new users here!'!J11<>\"\",IF('Add new users here!'!J11='Do not edit - Options'!$E$2,'Do not edit - Options'!$F$2,IF('Add new users here!'!J11='Do not edit - Options'!$E$3,'Do not edit - Options'!$F$3,IF('Add new users here!'!J11='Do not edit - Options'!$E$4,'Do not edit - Options'!$F$4,\"\"))),\"\")","v":""},{"$f":"IF('Add new users here!'!A11<>\"\",LOWER('Add new users here!'!A11),\"\")","v":""}]
[{"$f":"IF('Add new users here!'!A12<>\"\",LOWER('Add new users here!'!A12),\"\")","v":""},{"$f":"IF('Add new users here!'!B12<>\"\",'Add new users here!'!B12,\"\")","v":""},{"$f":"IF('Add new users here!'!C12<>\"\",'Add new users here!'!C12,\"\")","v":""},{"$f":"IF('Add new users here!'!D12<>\"\",'Add new users here!'!D12,\"\")","v":""},{"$f":"IF('Add new users here!'!E12<>\"\",LOWER('Add new users here!'!E12),\"\")","v":""},{"$f":"IF('Add new users here!'!H12<>\"\",(DATE('Add new users here!'!H12,'Add new users here!'!G12,'Add new users here!'!F12)-DATE(1970,1,1))*86400,IF('Add new users here!'!A12<>\"\",((TODAY()+365)-DATE(1970,1,1))*86400,\"\"))","v":""},{"$f":"IF('Add new users here!'!I12<>\"\",'Add new users here!'!I12,\"\")","v":""},{"$f":"IF('Add new users here!'!J12<>\"\",IF('Add new users here!'!J12='Do not edit - Options'!$E$2,'Do not edit - Options'!$F$2,IF('Add new users here!'!J12='Do not edit - Options'!$E$3,'Do not edit - Options'!$F$3,IF('Add new users here!'!J12='Do not edit - Options'!$E$4,'Do not edit - Options'!$F$4,\"\"))),\"\")","v":""},{"$f":"IF('Add new users here!'!A12<>\"\",LOWER('Add new users here!'!A12),\"\")","v":""}]
[{"$f":"IF('Add new users here!'!A13<>\"\",LOWER('Add new users here!'!A13),\"\")","v":""},{"$f":"IF('Add new users here!'!B13<>\"\",'Add new users here!'!B13,\"\")","v":""},{"$f":"IF('Add new users here!'!C13<>\"\",'Add new users here!'!C13,\"\")","v":""},{"$f":"IF('Add new users here!'!D13<>\"\",'Add new users here!'!D13,\"\")","v":""},{"$f":"IF('Add new users here!'!E13<>\"\",LOWER('Add new users here!'!E13),\"\")","v":""},{"$f":"IF('Add new users here!'!H13<>\"\",(DATE('Add new users here!'!H13,'Add new users here!'!G13,'Add new users here!'!F13)-DATE(1970,1,1))*86400,IF('Add new users here!'!A13<>\"\",((TODAY()+365)-DATE(1970,1,1))*86400,\"\"))","v":""},{"$f":"IF('Add new users here!'!I13<>\"\",'Add new users here!'!I13,\"\")","v":""},{"$f":"IF('Add new users here!'!J13<>\"\",IF('Add new users here!'!J13='Do not edit - Options'!$E$2,'Do not edit - Options'!$F$2,IF('Add new users here!'!J13='Do not edit - Options'!$E$3,'Do not edit - Options'!$F$3,IF('Add new users here!'!J13='Do not edit - Options'!$E$4,'Do not edit - Options'!$F$4,\"\"))),\"\")","v":""},{"$f":"IF('Add new users here!'!A13<>\"\",LOWER('Add new users here!'!A13),\"\")","v":""}]
[{"$f":"IF('Add new users here!'!A14<>\"\",LOWER('Add new users here!'!A14),\"\")","v":""},{"$f":"IF('Add new users here!'!B14<>\"\",'Add new users here!'!B14,\"\")","v":""},{"$f":"IF('Add new users here!'!C14<>\"\",'Add new users here!'!C14,\"\")","v":""},{"$f":"IF('Add new users here!'!D14<>\"\",'Add new users here!'!D14,\"\")","v":""},{"$f":"IF('Add new users here!'!E14<>\"\",LOWER('Add new users here!'!E14),\"\")","v":""},{"$f":"IF('Add new users here!'!H14<>\"\",(DATE('Add new users here!'!H14,'Add new users here!'!G14,'Add new users here!'!F14)-DATE(1970,1,1))*86400,IF('Add new users here!'!A14<>\"\",((TODAY()+365)-DATE(1970,1,1))*86400,\"\"))","v":""},{"$f":"IF('Add new users here!'!I14<>\"\",'Add new users here!'!I14,\"\")","v":""},{"$f":"IF('Add new users here!'!J14<>\"\",IF('Add new users here!'!J14='Do not edit - Options'!$E$2,'Do not edit - Options'!$F$2,IF('Add new users here!'!J14='Do not edit - Options'!$E$3,'Do not edit - Options'!$F$3,IF('Add new users here!'!J14='Do not edit - Options'!$E$4,'Do not edit - Options'!$F$4,\"\"))),\"\")","v":""},{"$f":"IF('Add new users here!'!A14<>\"\",LOWER('Add new users here!'!A14),\"\")","v":""}]
[{"$f":"IF('Add new users here!'!A15<>\"\",LOWER('Add new users here!'!A15),\"\")","v":""},{"$f":"IF('Add new users here!'!B15<>\"\",'Add new users here!'!B15,\"\")","v":""},{"$f":"IF('Add new users here!'!C15<>\"\",'Add new users here!'!C15,\"\")","v":""},{"$f":"IF('Add new users here!'!D15<>\"\",'Add new users here!'!D15,\"\")","v":""},{"$f":"IF('Add new users here!'!E15<>\"\",LOWER('Add new users here!'!E15),\"\")","v":""},{"$f":"IF('Add new users here!'!H15<>\"\",(DATE('Add new users here!'!H15,'Add new users here!'!G15,'Add new users here!'!F15)-DATE(1970,1,1))*86400,IF('Add new users here!'!A15<>\"\",((TODAY()+365)-DATE(1970,1,1))*86400,\"\"))","v":""},{"$f":"IF('Add new users here!'!I15<>\"\",'Add new users here!'!I15,\"\")","v":""},{"$f":"IF('Add new users here!'!J15<>\"\",IF('Add new users here!'!J15='Do not edit - Options'!$E$2,'Do not edit - Options'!$F$2,IF('Add new users here!'!J15='Do not edit - Options'!$E$3,'Do not edit - Options'!$F$3,IF('Add new users here!'!J15='Do not edit - Options'!$E$4,'Do not edit - Options'!$F$4,\"\"))),\"\")","v":""},{"$f":"IF('Add new users here!'!A15<>\"\",LOWER('Add new users here!'!A15),\"\")","v":""}]
[{"$f":"IF('Add new users here!'!A16<>\"\",LOWER('Add new users here!'!A16),\"\")","v":""},{"$f":"IF('Add new users here!'!B16<>\"\",'Add new users here!'!B16,\"\")","v":""},{"$f":"IF('Add new users here!'!C16<>\"\",'Add new users here!'!C16,\"\")","v":""},{"$f":"IF('Add new users here!'!D16<>\"\",'Add new users here!'!D16,\"\")","v":""},{"$f":"IF('Add new users here!'!E16<>\"\",LOWER('Add new users here!'!E16),\"\")","v":""},{"$f":"IF('Add new users here!'!H16<>\"\",(DATE('Add new users here!'!H16,'Add new users here!'!G16,'Add new users here!'!F16)-DATE(1970,1,1))*86400,IF('Add new users here!'!A16<>\"\",((TODAY()+365)-DATE(1970,1,1))*86400,\"\"))","v":""},{"$f":"IF('Add new users here!'!I16<>\"\",'Add new users here!'!I16,\"\")","v":""},{"$f":"IF('Add new users here!'!J16<>\"\",IF('Add new users here!'!J16='Do not edit - Options'!$E$2,'Do not edit - Options'!$F$2,IF('Add new users here!'!J16='Do not edit - Options'!$E$3,'Do not edit - Options'!$F$3,IF('Add new users here!'!J16='Do not edit - Options'!$E$4,'Do not edit - Options'!$F$4,\"\"))),\"\")","v":""},{"$f":"IF('Add new users here!'!A16<>\"\",LOWER('Add new users here!'!A16),\"\")","v":""}]
[{"$f":"IF('Add new users here!'!A17<>\"\",LOWER('Add new users here!'!A17),\"\")","v":""},{"$f":"IF('Add new users here!'!B17<>\"\",'Add new users here!'!B17,\"\")","v":""},{"$f":"IF('Add new users here!'!C17<>\"\",'Add new users here!'!C17,\"\")","v":""},{"$f":"IF('Add new users here!'!D17<>\"\",'Add new users here!'!D17,\"\")","v":""},{"$f":"IF('Add new users here!'!E17<>\"\",LOWER('Add new users here!'!E17),\"\")","v":""},{"$f":"IF('Add new users here!'!H17<>\"\",(DATE('Add new users here!'!H17,'Add new users here!'!G17,'Add new users here!'!F17)-DATE(1970,1,1))*86400,IF('Add new users here!'!A17<>\"\",((TODAY()+365)-DATE(1970,1,1))*86400,\"\"))","v":""},{"$f":"IF('Add new users here!'!I17<>\"\",'Add new users here!'!I17,\"\")","v":""},{"$f":"IF('Add new users here!'!J17<>\"\",IF('Add new users here!'!J17='Do not edit - Options'!$E$2,'Do not edit - Options'!$F$2,IF('Add new users here!'!J17='Do not edit - Options'!$E$3,'Do not edit - Options'!$F$3,IF('Add new users here!'!J17='Do not edit - Options'!$E$4,'Do not edit - Options'!$F$4,\"\"))),\"\")","v":""},{"$f":"IF('Add new users here!'!A17<>\"\",LOWER('Add new users here!'!A17),\"\")","v":""}]
[{"$f":"IF('Add new users here!'!A18<>\"\",LOWER('Add new users here!'!A18),\"\")","v":""},{"$f":"IF('Add new users here!'!B18<>\"\",'Add new users here!'!B18,\"\")","v":""},{"$f":"IF('Add new users here!'!C18<>\"\",'Add new users here!'!C18,\"\")","v":""},{"$f":"IF('Add new users here!'!D18<>\"\",'Add new users here!'!D18,\"\")","v":""},{"$f":"IF('Add new users here!'!E18<>\"\",LOWER('Add new users here!'!E18),\"\")","v":""},{"$f":"IF('Add new users here!'!H18<>\"\",(DATE('Add new users here!'!H18,'Add new users here!'!G18,'Add new users here!'!F18)-DATE(1970,1,1))*86400,IF('Add new users here!'!A18<>\"\",((TODAY()+365)-DATE(1970,1,1))*86400,\"\"))","v":""},{"$f":"IF('Add new users here!'!I18<>\"\",'Add new users here!'!I18,\"\")","v":""},{"$f":"IF('Add new users here!'!J18<>\"\",IF('Add new users here!'!J18='Do not edit - Options'!$E$2,'Do not edit - Options'!$F$2,IF('Add new users here!'!J18='Do not edit - Options'!$E$3,'Do not edit - Options'!$F$3,IF('Add new users here!'!J18='Do not edit - Options'!$E$4,'Do not edit - Options'!$F$4,\"\"))),\"\")","v":""},{"$f":"IF('Add new users here!'!A18<>\"\",LOWER('Add new users here!'!A18),\"\")","v":""}]
[{"$f":"IF('Add new users here!'!A19<>\"\",LOWER('Add new users here!'!A19),\"\")","v":""},{"$f":"IF('Add new users here!'!B19<>\"\",'Add new users here!'!B19,\"\")","v":""},{"$f":"IF('Add new users here!'!C19<>\"\",'Add new users here!'!C19,\"\")","v":""},{"$f":"IF('Add new users here!'!D19<>\"\",'Add new users here!'!D19,\"\")","v":""},{"$f":"IF('Add new users here!'!E19<>\"\",LOWER('Add new users here!'!E19),\"\")","v":""},{"$f":"IF('Add new users here!'!H19<>\"\",(DATE('Add new users here!'!H19,'Add new users here!'!G19,'Add new users here!'!F19)-DATE(1970,1,1))*86400,IF('Add new users here!'!A19<>\"\",((TODAY()+365)-DATE(1970,1,1))*86400,\"\"))","v":""},{"$f":"IF('Add new users here!'!I19<>\"\",'Add new users here!'!I19,\"\")","v":""},{"$f":"IF('Add new users here!'!J19<>\"\",IF('Add new users here!'!J19='Do not edit - Options'!$E$2,'Do not edit - Options'!$F$2,IF('Add new users here!'!J19='Do not edit - Options'!$E$3,'Do not edit - Options'!$F$3,IF('Add new users here!'!J19='Do not edit - Options'!$E$4,'Do not edit - Options'!$F$4,\"\"))),\"\")","v":""},{"$f":"IF('Add new users here!'!A19<>\"\",LOWER('Add new users here!'!A19),\"\")","v":""}]
[{"$f":"IF('Add new users here!'!A20<>\"\",LOWER('Add new users here!'!A20),\"\")","v":""},{"$f":"IF('Add new users here!'!B20<>\"\",'Add new users here!'!B20,\"\")","v":""},{"$f":"IF('Add new users here!'!C20<>\"\",'Add new users here!'!C20,\"\")","v":""},{"$f":"IF('Add new users here!'!D20<>\"\",'Add new users here!'!D20,\"\")","v":""},{"$f":"IF('Add new users here!'!E20<>\"\",LOWER('Add new users here!'!E20),\"\")","v":""},{"$f":"IF('Add new users here!'!H20<>\"\",(DATE('Add new users here!'!H20,'Add new users here!'!G20,'Add new users here!'!F20)-DATE(1970,1,1))*86400,IF('Add new users here!'!A20<>\"\",((TODAY()+365)-DATE(1970,1,1))*86400,\"\"))","v":""},{"$f":"IF('Add new users here!'!I20<>\"\",'Add new users here!'!I20,\"\")","v":""},{"$f":"IF('Add new users here!'!J20<>\"\",IF('Add new users here!'!J20='Do not edit - Options'!$E$2,'Do not edit - Options'!$F$2,IF('Add new users here!'!J20='Do not edit - Options'!$E$3,'Do not edit - Options'!$F$3,IF('Add new users here!'!J20='Do not edit - Options'!$E$4,'Do not edit - Options'!$F$4,\"\"))),\"\")","v":""},{"$f":"IF('Add new users here!'!A20<>\"\",LOWER('Add new users here!'!A20),\"\")","v":""}]
[{"$f":"IF('Add new users here!'!A21<>\"\",LOWER('Add new users here!'!A21),\"\")","v":""},{"$f":"IF('Add new users here!'!B21<>\"\",'Add new users here!'!B21,\"\")","v":""},{"$f":"IF('Add new users here!'!C21<>\"\",'Add new users here!'!C21,\"\")","v":""},{"$f":"IF('Add new users here!'!D21<>\"\",'Add new users here!'!D21,\"\")","v":""},{"$f":"IF('Add new users here!'!E21<>\"\",LOWER('Add new users here!'!E21),\"\")","v":""},{"$f":"IF('Add new users here!'!H21<>\"\",(DATE('Add new users here!'!H21,'Add new users here!'!G21,'Add new users here!'!F21)-DATE(1970,1,1))*86400,IF('Add new users here!'!A21<>\"\",((TODAY()+365)-DATE(1970,1,1))*86400,\"\"))","v":""},{"$f":"IF('Add new users here!'!I21<>\"\",'Add new users here!'!I21,\"\")","v":""},{"$f":"IF('Add new users here!'!J21<>\"\",IF('Add new users here!'!J21='Do not edit - Options'!$E$2,'Do not edit - Options'!$F$2,IF('Add new users here!'!J21='Do not edit - Options'!$E$3,'Do not edit - Options'!$F$3,IF('Add new users here!'!J21='Do not edit - Options'!$E$4,'Do not edit - Options'!$F$4,\"\"))),\"\")","v":""},{"$f":"IF('Add new users here!'!A21<>\"\",LOWER('Add new users here!'!A21),\"\")","v":""}]
[{"$f":"IF('Add new users here!'!A22<>\"\",LOWER('Add new users here!'!A22),\"\")","v":""},{"$f":"IF('Add new users here!'!B22<>\"\",'Add new users here!'!B22,\"\")","v":""},{"$f":"IF('Add new users here!'!C22<>\"\",'Add new users here!'!C22,\"\")","v":""},{"$f":"IF('Add new users here!'!D22<>\"\",'Add new users here!'!D22,\"\")","v":""},{"$f":"IF('Add new users here!'!E22<>\"\",LOWER('Add new users here!'!E22),\"\")","v":""},{"$f":"IF('Add new users here!'!H22<>\"\",(DATE('Add new users here!'!H22,'Add new users here!'!G22,'Add new users here!'!F22)-DATE(1970,1,1))*86400,IF('Add new users here!'!A22<>\"\",((TODAY()+365)-DATE(1970,1,1))*86400,\"\"))","v":""},{"$f":"IF('Add new users here!'!I22<>\"\",'Add new users here!'!I22,\"\")","v":""},{"$f":"IF('Add new users here!'!J22<>\"\",IF('Add new users here!'!J22='Do not edit - Options'!$E$2,'Do not edit - Options'!$F$2,IF('Add new users here!'!J22='Do not edit - Options'!$E$3,'Do not edit - Options'!$F$3,IF('Add new users here!'!J22='Do not edit - Options'!$E$4,'Do not edit - Options'!$F$4,\"\"))),\"\")","v":""},{"$f":"IF('Add new users here!'!A22<>\"\",LOWER('Add new users here!'!A22),\"\")","v":""}]
{"$rows_left_out":481}
{"sheet":"Do not edit - Options","index":3,"n_rows":51,"n_cols":7,"rows_kept":51,"cut":false,"hidden":true,"merged":[]}
["Language","Account valid to (day)","Account valid to (month)","Account valid to (year)","Role in course","Role in course (Moodle values)","HAKA eligble email"]
["fi",1,1,2019,"student","student","aalto.fi"]
["en",2,2,2020,"teacher","editingteacher","arcada.fi"]
[null,3,3,2021,"non-editing teacher","teacher","centria.fi"]
[null,4,4,2022,null,null,"csc.fi"]
[null,5,5,2023,null,null,"diak.fi"]
[null,6,6,2024,null,null,"vyv.fi"]
[null,7,7,2025,null,null,"fmi.fi"]
[null,8,8,2026,null,null,"oph.fi"]
[null,9,9,2027,null,null,"funidata.fi"]
[null,10,10,2028,null,null,"valtori.fi"]
[null,11,11,2029,null,null,"haaga-helia.fi"]
[null,12,12,2030,null,null,"shh.fi"]
[null,13,null,2031,null,null,"humak.fi"]
[null,14,null,2032,null,null,"hamk.fi"]
[null,15,null,2033,null,null,"vyv.fi"]
[null,16,null,2034,null,null,"jamk.fi"]
[null,17,null,2035,null,null,"kamit.fi"]
[null,18,null,2036,null,null,"pkamk.fi"]
[null,19,null,2037,null,null,"psshp.fi"]
{"$rows_left_out":31}